Reaction Details
TargetCarbonic anhydrase 1
LigandBDBM50205570
Substrate/Competitorn/a
Meas. Tech.ChEMBL_1628394 (CHEMBL3870979)
Ki>10000±n/a nM
Citation Esirden, ITanç, MSupuran, CTKaya, M Microwave assisted synthesis of novel tetrazole/sulfonamide derivatives based on octahydroacridine, xanthene and chromene skeletons as inhibitors of the carbonic anhydrases isoforms I, II, IV and VII. Bioorg Med Chem Lett27:86-89 (2017) 
 
Carbonic anhydrase 1
Name:Carbonic anhydrase 1
Type:Enzyme
Mol. Mass.:28873.37
Organism:Homo sapiens (Human)
Description:P00915
Residue:261
BDBM50205570
NameBDBM50205570
Synonyms:CHEMBL3970750
TypeSmall organic molecule
Emp. Form.C20H18N4O3
Mol. Mass.362.3819
SMILESO=C1CCCC2=C1C(C1=C(CCCC1=O)O2)c1cccc(c1)-c1nnn[nH]1