Reaction Details
TargetCarbonic anhydrase 4
LigandBDBM50205595
Substrate/Competitorn/a
Meas. Tech.ChEMBL_1628396 (CHEMBL3870981)
Ki 6056±n/a nM
Citation Esirden, ITanç, MSupuran, CTKaya, M Microwave assisted synthesis of novel tetrazole/sulfonamide derivatives based on octahydroacridine, xanthene and chromene skeletons as inhibitors of the carbonic anhydrases isoforms I, II, IV and VII. Bioorg Med Chem Lett27:86-89 (2017) 
 
Carbonic anhydrase 4
Name:Carbonic anhydrase 4
Type:Enzyme
Mol. Mass.:35037.98
Organism:Homo sapiens (Human)
Description:P22748
Residue:312
BDBM50205595
NameBDBM50205595
Synonyms:CHEMBL3955992
TypeSmall organic molecule
Emp. Form.C26H24N6O4S
Mol. Mass.516.572
SMILESNS(=O)(=O)c1ccc(cc1)N1C2=C(C(C3=C1CCCC3=O)c1cccc(c1)-c1nnn[nH]1)C(=O)CCC2