Reaction Details
TargetCarbonic anhydrase 4
LigandBDBM50205566
Substrate/Competitorn/a
Meas. Tech.ChEMBL_1628396 (CHEMBL3870981)
Ki 8489±n/a nM
Citation Esirden, ITanç, MSupuran, CTKaya, M Microwave assisted synthesis of novel tetrazole/sulfonamide derivatives based on octahydroacridine, xanthene and chromene skeletons as inhibitors of the carbonic anhydrases isoforms I, II, IV and VII. Bioorg Med Chem Lett27:86-89 (2017) 
 
Carbonic anhydrase 4
Name:Carbonic anhydrase 4
Type:Enzyme
Mol. Mass.:35037.98
Organism:Homo sapiens (Human)
Description:P22748
Residue:312
BDBM50205566
NameBDBM50205566
Synonyms:CHEMBL3947267
TypeSmall organic molecule
Emp. Form.C30H32N6O4S
Mol. Mass.572.678
SMILESCC1(C)CC(=O)C2=C(C1)N(C1=C(C2c2cccc(c2)-c2nnn[nH]2)C(=O)CC(C)(C)C1)c1ccc(cc1)S(N)(=O)=O