Reaction Details
TargetcAMP-specific 3',5'-cyclic phosphodiesterase 4B
LigandBDBM50205608
Substrate/Competitorn/a
Meas. Tech.ChEMBL_1628442 (CHEMBL3871027)
IC50 1410±n/a nM
Citation Guariento, SKarawajczyk, ABull, JAMarchini, GBielska, MIwanowa, XBruno, OFossa, PGiordanetto, F Design and synthesis of 4,5,6,7-tetrahydro-1H-1,2-diazepin-7-one derivatives as a new series of Phosphodiesterase 4 (PDE4) inhibitors. Bioorg Med Chem Lett27:24-29 (2017) 
 
cAMP-specific 3',5'-cyclic phosphodiesterase 4B
Name:cAMP-specific 3',5'-cyclic phosphodiesterase 4B
Type:Protein
Mol. Mass.:83318.87
Organism:Homo sapiens (Human)
Description:Q07343
Residue:736
BDBM50205608
NameBDBM50205608
Synonyms:CHEMBL3898376
TypeSmall organic molecule
Emp. Form.C19H21N3O3
Mol. Mass.339.3883
SMILESCOc1ccc(cc1OC)C1=NN(Cc2ccncc2)C(=O)CCC1