Reaction Details
TargetMacrophage migration inhibitory factor
LigandBDBM50206083
Substrate/Competitorn/a
Meas. Tech.ChEMBL_1628621 (CHEMBL3871206)
Ki 39±n/a nM
Citation Cisneros, JARobertson, MJMercado, BQJorgensen, WL Systematic Study of Effects of Structural Modifications on the Aqueous Solubility of Drug-like Molecules. ACS Med Chem Lett8:124-127 (2017) 
 
Macrophage migration inhibitory factor
Name:Macrophage migration inhibitory factor
Type:Enzyme
Mol. Mass.:12478.18
Organism:Homo sapiens (Human)
Description:P14174
Residue:115
BDBM50206083
NameBDBM50206083
Synonyms:CHEMBL3927658 | US10968198, Example 43
TypeSmall organic molecule
Emp. Form.C21H17FN4O4
Mol. Mass.408.3825
SMILESOC(=O)CCCOc1ccc2nc(ccc2c1)-c1cn(nn1)-c1ccc(O)c(F)c1