Reaction Details
TargetMacrophage migration inhibitory factor
LigandBDBM50167988
Substrate/Competitorn/a
Meas. Tech.ChEMBL_1628623 (CHEMBL3871208)
Kd 24000±n/a nM
Citation Cisneros, JARobertson, MJMercado, BQJorgensen, WL Systematic Study of Effects of Structural Modifications on the Aqueous Solubility of Drug-like Molecules. ACS Med Chem Lett8:124-127 (2017) 
 
Macrophage migration inhibitory factor
Name:Macrophage migration inhibitory factor
Type:Enzyme
Mol. Mass.:12478.18
Organism:Homo sapiens (Human)
Description:P14174
Residue:115
BDBM50167988
NameBDBM50167988
Synonyms:CHEMBL3798703
TypeSmall organic molecule
Emp. Form.C11H11NO4
Mol. Mass.221.2093
SMILESCOC(=O)[C@H]1CC(=NO1)c1ccc(O)cc1