Reaction Details
TargetMacrophage migration inhibitory factor
LigandBDBM50206093
Substrate/Competitorn/a
Meas. Tech.ChEMBL_1628621 (CHEMBL3871206)
Ki 530±n/a nM
Citation Cisneros, JARobertson, MJMercado, BQJorgensen, WL Systematic Study of Effects of Structural Modifications on the Aqueous Solubility of Drug-like Molecules. ACS Med Chem Lett8:124-127 (2017) 
 
Macrophage migration inhibitory factor
Name:Macrophage migration inhibitory factor
Type:Enzyme
Mol. Mass.:12478.18
Organism:Homo sapiens (Human)
Description:P14174
Residue:115
BDBM50206093
NameBDBM50206093
Synonyms:CHEMBL3925522
TypeSmall organic molecule
Emp. Form.C19H16N4O3
Mol. Mass.348.3553
SMILESOCCOc1ccc2nc(ccc2c1)-c1cn(nn1)-c1ccc(O)cc1