Reaction Details
TargetPolyunsaturated fatty acid lipoxygenase ALOX15
LigandBDBM50123669
Substrate/Competitorn/a
Meas. Tech.ChEMBL_1628732 (CHEMBL3871358)
Ki 36±n/a nM
Citation Eleftheriadis, NPoelman, HLeus, NGJHonrath, BNeochoritis, CGDolga, ADömling, ADekker, FJ Design of a novel thiophene inhibitor of 15-lipoxygenase-1 with both anti-inflammatory and neuroprotective properties. Eur J Med Chem122:786-801 (2016) 
 
Polyunsaturated fatty acid lipoxygenase ALOX15
Name:Polyunsaturated fatty acid lipoxygenase ALOX15
Type:Protein
Mol. Mass.:74804.05
Organism:Homo sapiens (Human)
Description:n/a
Residue:662
BDBM50123669
NameBDBM50123669
Synonyms:CHEMBL3622735
TypeSmall organic molecule
Emp. Form.C21H28ClNO3
Mol. Mass.377.905
SMILESCCOC(=O)c1[nH]c2cc(Cl)ccc2c1C(=O)C[C@@H](C)CCCC(C)C