Reaction Details
TargetKynurenine 3-monooxygenase
LigandBDBM50206570
Substrate/Competitorn/a
Meas. Tech.ChEBML_1629193
IC50 6.0±n/a nM
Citation Amin, SAAdhikari, NJha, TGayen, S First molecular modeling report on novel arylpyrimidine kynurenine monooxygenase inhibitors through multi-QSAR analysis against Huntington's disease: A proposal to chemists! Bioorg Med Chem Lett26:5712-5718 (2016) 
 
Kynurenine 3-monooxygenase
Name:Kynurenine 3-monooxygenase
Type:PROTEIN
Mol. Mass.:55831.03
Organism:Homo sapiens (Human)
Description:ChEMBL_1487479
Residue:486
BDBM50206570
NameBDBM50206570
Synonyms:CHEMBL3965088
TypeSmall organic molecule
Emp. Form.C14H13ClN2O3
Mol. Mass.292.718
SMILESCC(C)Oc1ccc(cc1Cl)-c1ccnc(n1)C(O)=O