Reaction Details
TargetProthrombin
LigandBDBM50112086
Substrate/Competitorn/a
Meas. Tech.ChEMBL_1629274 (CHEMBL3871900)
IC50 6.0±n/a nM
Citation Chen, DShi, JLiu, JZhang, XDeng, XYang, YCui, SZhu, QGong, GXu, Y Design, synthesis and antithrombotic evaluation of novel non-peptide thrombin inhibitors. Bioorg Med Chem25:458-470 (2017) 
 
Prothrombin
Name:Prothrombin
Type:Protein
Mol. Mass.:70029.57
Organism:Homo sapiens (Human)
Description:P00734
Residue:622
BDBM50112086
NameBDBM50112086
Synonyms:3-({2-[(4-Carbamimidoyl-phenylamino)-methyl]-1-methyl-1H-benzoimidazole-5-carbonyl}-pyridin-2-yl-amino)-propionic acid DABIGATRAN
TypeSmall organic molecule
Emp. Form.C25H25N7O3
Mol. Mass.471.5111
SMILESCn1c(CNc2ccc(cc2)C(N)=N)nc2cc(ccc12)C(=O)N(CCC(O)=O)c1ccccn1