Reaction Details
TargetCytochrome P450 2C9
LigandBDBM50343939
Substrate/Competitorn/a
Meas. Tech.ChEBML_1629311
IC50 1700±n/a nM
Citation Morioka, M 3-Cyano-6-(5-methyl-3-pyrazoloamino) pyridines (Part 2): A dual inhibitor of Aurora kinase and tubulin polymerization. Bioorg Med Chem Lett26:5860-5862 (2016) 
 
Cytochrome P450 2C9
Name:Cytochrome P450 2C9
Type:Enzyme
Mol. Mass.:55636.33
Organism:Homo sapiens (Human)
Description:P11712
Residue:490
BDBM50343939
NameBDBM50343939
Synonyms:(S)-2-(6-hydroxy-6-methylheptan-2-ylamino)-4-methyl-6-(5-methyl-1H-pyrazol-3-ylamino)nicotinonitrile | CHEMBL1778663
TypeSmall organic molecule
Emp. Form.C19H28N6O
Mol. Mass.356.4652
SMILESC[C@@H](CCCC(C)(C)O)Nc1nc(Nc2cc(C)n[nH]2)cc(C)c1C#N