Reaction Details
TargetAurora kinase A
LigandBDBM50206865
Substrate/Competitorn/a
Meas. Tech.ChEMBL_1629279 (CHEMBL3871905)
Ki 2±n/a nM
Citation Morioka, M 3-Cyano-6-(5-methyl-3-pyrazoloamino) pyridines (Part 2): A dual inhibitor of Aurora kinase and tubulin polymerization. Bioorg Med Chem Lett26:5860-5862 (2016) 
 
Aurora kinase A
Name:Aurora kinase A
Type:Serine/threonine-protein kinase
Mol. Mass.:45830.98
Organism:Homo sapiens (Human)
Description:O14965
Residue:403
BDBM50206865
NameBDBM50206865
Synonyms:CHEMBL3912923
TypeSmall organic molecule
Emp. Form.C18H19N7O
Mol. Mass.349.3898
SMILESCc1cc(Nc2cc(C)c(C#N)c(NCCOc3cccnc3)n2)n[nH]1