Reaction Details
TargetAurora kinase A
LigandBDBM50206860
Substrate/Competitorn/a
Meas. Tech.ChEMBL_1629279 (CHEMBL3871905)
Ki 1±n/a nM
Citation Morioka, M 3-Cyano-6-(5-methyl-3-pyrazoloamino) pyridines (Part 2): A dual inhibitor of Aurora kinase and tubulin polymerization. Bioorg Med Chem Lett26:5860-5862 (2016) 
 
Aurora kinase A
Name:Aurora kinase A
Type:Serine/threonine-protein kinase
Mol. Mass.:45830.98
Organism:Homo sapiens (Human)
Description:O14965
Residue:403
BDBM50206860
NameBDBM50206860
Synonyms:CHEMBL3974799
TypeSmall organic molecule
Emp. Form.C19H19ClN6O
Mol. Mass.382.847
SMILESCc1cc(Nc2cc(C)c(C#N)c(NCCOc3ccccc3Cl)n2)n[nH]1