Reaction Details
TargetCytochrome P450 2C19
LigandBDBM50206860
Substrate/Competitorn/a
Meas. Tech.ChEMBL_1629310 (CHEMBL3871936)
IC50<400±n/a nM
Citation Morioka, M 3-Cyano-6-(5-methyl-3-pyrazoloamino) pyridines (Part 2): A dual inhibitor of Aurora kinase and tubulin polymerization. Bioorg Med Chem Lett26:5860-5862 (2016) 
 
Cytochrome P450 2C19
Name:Cytochrome P450 2C19
Type:Enzyme
Mol. Mass.:55935.47
Organism:Homo sapiens (Human)
Description:P33261
Residue:490
BDBM50206860
NameBDBM50206860
Synonyms:CHEMBL3974799
TypeSmall organic molecule
Emp. Form.C19H19ClN6O
Mol. Mass.382.847
SMILESCc1cc(Nc2cc(C)c(C#N)c(NCCOc3ccccc3Cl)n2)n[nH]1