Reaction Details
TargetHeat shock protein HSP 90-alpha
LigandBDBM39605
Substrate/Competitorn/a
Meas. Tech.ChEMBL_1629466 (CHEMBL3872092)
Kd 2000±n/a nM
Citation Huang, RAyine-Tora, DMMuhammad Rosdi, MNLi, YReynisson, JLeung, IKH Virtual screening and biophysical studies lead to HSP90 inhibitors. Bioorg Med Chem Lett27:277-281 (2017) 
 
Heat shock protein HSP 90-alpha
Name:Heat shock protein HSP 90-alpha
Type:Molecular Chaperone
Mol. Mass.:84623.45
Organism:Homo sapiens (Human)
Description:P07900
Residue:732
BDBM39605
NameBDBM39605
Synonyms:5-[2-(2,4-dihydroxy-5-propyl-phenyl)-2-keto-ethyl]furan-2-carboxylic acid ethyl ester MLS000097854 cid_765919 ethyl 5-[2-[2,4-bis(oxidanyl)-5-propyl-phenyl]-2-oxidanylidene-ethyl]furan-2-carboxylate
TypeSmall organic molecule
Emp. Form.C18H20O6
Mol. Mass.332.3478
SMILESCCCc1cc(C(=O)Cc2ccc(o2)C(=O)OCC)c(O)cc1O