Reaction Details
TargetAromatase
LigandBDBM50206963
Substrate/Competitorn/a
Meas. Tech.ChEMBL_1629490 (CHEMBL3872116)
IC50 790±n/a nM
Citation Whitehead, BRLo, MMAli, APark, MKHoyt, SBXiong, YCai, JCarswell, ECooke, AMacLean, JRatcliffe, PRobinson, JBennett, DJClemas, JAWisniewski, TStruthers, MCully, DMacNeil, DJ Imidazopyridyl compounds as aldosterone synthase inhibitors. Bioorg Med Chem Lett27:143-146 (2017) 
 
Aromatase
Name:Aromatase
Type:Enzyme
Mol. Mass.:57888.92
Organism:Homo sapiens (Human)
Description:P11511
Residue:503
BDBM50206963
NameBDBM50206963
Synonyms:CHEMBL3948337 | US9518055, Example 41
TypeSmall organic molecule
Emp. Form.C19H14FN3
Mol. Mass.303.333
SMILESFc1ccc2nc(c(C3CC3)n2c1)-c1cncc2ccccc12