Reaction Details
TargetD(3) dopamine receptor
LigandBDBM50206982
Substrate/Competitorn/a
Meas. Tech.ChEMBL_1629511 (CHEMBL3872137)
Ki 1000±n/a nM
Citation Saavedra, OMKarila, DBrossard, DRojas, ADupuis, DGohier, AMannoury la Cour, CMillan, MJOrtuno, JCHanessian, S Design and synthesis of novel N-sulfonyl-2-indoles that behave as 5-HT Bioorg Med Chem25:38-52 (2017) 
 
D(3) dopamine receptor
Name:D(3) dopamine receptor
Type:n/a
Mol. Mass.:44243.43
Organism:Homo sapiens (Human)
Description:n/a
Residue:400
BDBM50206982
NameBDBM50206982
Synonyms:CHEMBL3971039
TypeSmall organic molecule
Emp. Form.C19H20N2O3S
Mol. Mass.356.439
SMILESCN[C@H]1[C@@H](CCO)c2cc3ccn(c3cc12)S(=O)(=O)c1ccccc1