Reaction Details
TargetD(2) dopamine receptor
LigandBDBM50206983
Substrate/Competitorn/a
Meas. Tech.ChEMBL_1629510 (CHEMBL3872136)
Ki<10000±n/a nM
Citation Saavedra, OMKarila, DBrossard, DRojas, ADupuis, DGohier, AMannoury la Cour, CMillan, MJOrtuno, JCHanessian, S Design and synthesis of novel N-sulfonyl-2-indoles that behave as 5-HT Bioorg Med Chem25:38-52 (2017) 
 
D(2) dopamine receptor
Name:D(2) dopamine receptor
Type:Cell-surface receptors
Mol. Mass.:50647.10
Organism:Homo sapiens (Human)
Description:P14416
Residue:443
BDBM50206983
NameBDBM50206983
Synonyms:CHEMBL3908917
TypeSmall organic molecule
Emp. Form.C19H20N2O3S
Mol. Mass.356.439
SMILESCN[C@H]1[C@@H](CCO)c2c1ccc1n(ccc21)S(=O)(=O)c1ccccc1