Reaction Details
TargetD(3) dopamine receptor
LigandBDBM50207046
Substrate/Competitorn/a
Meas. Tech.ChEMBL_1629511 (CHEMBL3872137)
Ki 1259±n/a nM
Citation Saavedra, OMKarila, DBrossard, DRojas, ADupuis, DGohier, AMannoury la Cour, CMillan, MJOrtuno, JCHanessian, S Design and synthesis of novel N-sulfonyl-2-indoles that behave as 5-HT Bioorg Med Chem25:38-52 (2017) 
 
D(3) dopamine receptor
Name:D(3) dopamine receptor
Type:n/a
Mol. Mass.:44243.43
Organism:Homo sapiens (Human)
Description:n/a
Residue:400
BDBM50207046
NameBDBM50207046
Synonyms:CHEMBL3929918
TypeSmall organic molecule
Emp. Form.C18H18N2O2S
Mol. Mass.326.413
SMILESCNCC1Cc2ccc3n(ccc3c12)S(=O)(=O)c1ccccc1