Reaction Details
TargetD(3) dopamine receptor
LigandBDBM50207038
Substrate/Competitorn/a
Meas. Tech.ChEMBL_1629511 (CHEMBL3872137)
Ki 794±n/a nM
Citation Saavedra, OMKarila, DBrossard, DRojas, ADupuis, DGohier, AMannoury la Cour, CMillan, MJOrtuno, JCHanessian, S Design and synthesis of novel N-sulfonyl-2-indoles that behave as 5-HT Bioorg Med Chem25:38-52 (2017) 
 
D(3) dopamine receptor
Name:D(3) dopamine receptor
Type:n/a
Mol. Mass.:44243.43
Organism:Homo sapiens (Human)
Description:n/a
Residue:400
BDBM50207038
NameBDBM50207038
Synonyms:CHEMBL3961596
TypeSmall organic molecule
Emp. Form.C22H20N2O2S
Mol. Mass.376.471
SMILESCNCC1Cc2cc3ccn(c3cc12)S(=O)(=O)c1cccc2ccccc12