Reaction Details
TargetD(2) dopamine receptor
LigandBDBM50207046
Substrate/Competitorn/a
Meas. Tech.ChEMBL_1629510 (CHEMBL3872136)
Ki 1995±n/a nM
Citation Saavedra, OMKarila, DBrossard, DRojas, ADupuis, DGohier, AMannoury la Cour, CMillan, MJOrtuno, JCHanessian, S Design and synthesis of novel N-sulfonyl-2-indoles that behave as 5-HT Bioorg Med Chem25:38-52 (2017) 
 
D(2) dopamine receptor
Name:D(2) dopamine receptor
Type:Cell-surface receptors
Mol. Mass.:50647.10
Organism:Homo sapiens (Human)
Description:P14416
Residue:443
BDBM50207046
NameBDBM50207046
Synonyms:CHEMBL3929918
TypeSmall organic molecule
Emp. Form.C18H18N2O2S
Mol. Mass.326.413
SMILESCNCC1Cc2ccc3n(ccc3c12)S(=O)(=O)c1ccccc1