Reaction Details
Target5-hydroxytryptamine receptor 2A
LigandBDBM50207145
Substrate/Competitorn/a
Meas. Tech.ChEMBL_1630072 (CHEMBL3872778)
EC50>10000±n/a nM
Citation Chen, XWSun, YYFu, LLi, JQ Synthesis and pharmacological characterization of novel N-(trans-4-(2-(4-(benzo[d]isothiazol-3-yl)piperazin-1-yl)ethyl)cyclohexyl)amides as potential multireceptor atypical antipsychotics. Eur J Med Chem123:332-353 (2016) 
 
5-hydroxytryptamine receptor 2A
Name:5-hydroxytryptamine receptor 2A
Type:undefined
Mol. Mass.:52607.65
Organism:Homo sapiens (Human)
Description:P28223
Residue:471
BDBM50207145
NameBDBM50207145
Synonyms:CHEMBL3946995 | US9550741, I-1
TypeSmall organic molecule
Emp. Form.C24H30N4O2S
Mol. Mass.438.586
SMILESO=C(N[C@H]1CC[C@H](CCN2CCN(CC2)c2nsc3ccccc23)CC1)c1ccco1