Reaction Details
TargetD(2) dopamine receptor
LigandBDBM50207156
Substrate/Competitorn/a
Meas. Tech.ChEMBL_1630049 (CHEMBL3872755)
Ki 0.210000±n/a nM
Citation Chen, XWSun, YYFu, LLi, JQ Synthesis and pharmacological characterization of novel N-(trans-4-(2-(4-(benzo[d]isothiazol-3-yl)piperazin-1-yl)ethyl)cyclohexyl)amides as potential multireceptor atypical antipsychotics. Eur J Med Chem123:332-353 (2016) 
 
D(2) dopamine receptor
Name:D(2) dopamine receptor
Type:Cell-surface receptors
Mol. Mass.:50647.10
Organism:Homo sapiens (Human)
Description:P14416
Residue:443
BDBM50207156
NameBDBM50207156
Synonyms:CHEMBL3938210 | US9550741, I-3
TypeSmall organic molecule
Emp. Form.C24H31N5OS
Mol. Mass.437.601
SMILESO=C(N[C@H]1CC[C@H](CCN2CCN(CC2)c2nsc3ccccc23)CC1)c1ccc[nH]1