Reaction Details
TargetD(2) dopamine receptor
LigandBDBM50207115
Substrate/Competitorn/a
Meas. Tech.ChEMBL_1630049 (CHEMBL3872755)
Ki 0.420000±n/a nM
Citation Chen, XWSun, YYFu, LLi, JQ Synthesis and pharmacological characterization of novel N-(trans-4-(2-(4-(benzo[d]isothiazol-3-yl)piperazin-1-yl)ethyl)cyclohexyl)amides as potential multireceptor atypical antipsychotics. Eur J Med Chem123:332-353 (2016) 
 
D(2) dopamine receptor
Name:D(2) dopamine receptor
Type:Cell-surface receptors
Mol. Mass.:50647.10
Organism:Homo sapiens (Human)
Description:P14416
Residue:443
BDBM50207115
NameBDBM50207115
Synonyms:CHEMBL3948056
TypeSmall organic molecule
Emp. Form.C26H34N4O2S2
Mol. Mass.498.704
SMILESCc1ccc(cc1)S(=O)(=O)N[C@H]1CC[C@H](CCN2CCN(CC2)c2nsc3ccccc23)CC1