Reaction Details
TargetPancreatic triacylglycerol lipase
LigandBDBM50207381
Substrate/Competitorn/a
Meas. Tech.ChEMBL_1631106 (CHEMBL3873812)
Ki 19600±n/a nM
Citation Sridhar, SNGinson, GVenkataramana Reddy, POTantak, MPKumar, DPaul, AT Synthesis, evaluation and molecular modelling studies of 2-(carbazol-3-yl)-2-oxoacetamide analogues as a new class of potential pancreatic lipase inhibitors. Bioorg Med Chem25:609-620 (2017) 
 
Pancreatic triacylglycerol lipase
Name:Pancreatic triacylglycerol lipase
Type:Enzyme
Mol. Mass.:50080.69
Organism:Sus scrofa (Pig)
Description:P00591
Residue:450
BDBM50207381
NameBDBM50207381
Synonyms:CHEMBL3934940
TypeSmall organic molecule
Emp. Form.C30H25ClN2O5
Mol. Mass.528.983
SMILESCOc1cc(NC(=O)C(=O)c2ccc3n(Cc4ccc(Cl)cc4)c4ccccc4c3c2)cc(OC)c1OC