Reaction Details
TargetPancreatic triacylglycerol lipase
LigandBDBM50207370
Substrate/Competitorn/a
Meas. Tech.ChEMBL_1631106 (CHEMBL3873812)
Ki 21600±n/a nM
Citation Sridhar, SNGinson, GVenkataramana Reddy, POTantak, MPKumar, DPaul, AT Synthesis, evaluation and molecular modelling studies of 2-(carbazol-3-yl)-2-oxoacetamide analogues as a new class of potential pancreatic lipase inhibitors. Bioorg Med Chem25:609-620 (2017) 
 
Pancreatic triacylglycerol lipase
Name:Pancreatic triacylglycerol lipase
Type:Enzyme
Mol. Mass.:50080.69
Organism:Sus scrofa (Pig)
Description:P00591
Residue:450
BDBM50207370
NameBDBM50207370
Synonyms:CHEMBL3896540
TypeSmall organic molecule
Emp. Form.C23H20N2O5
Mol. Mass.404.4153
SMILESCOc1cc(NC(=O)C(=O)c2ccc3[nH]c4ccccc4c3c2)cc(OC)c1OC