Reaction Details
TargetCarbonic anhydrase 12
LigandBDBM50207539
Substrate/Competitorn/a
Meas. Tech.ChEMBL_1632055 (CHEMBL3874761)
Ki 56±n/a nM
Citation Bozdag, MAlafeefy, AMAltamimi, AMVullo, DCarta, FSupuran, CT Coumarins and other fused bicyclic heterocycles with selective tumor-associated carbonic anhydrase isoforms inhibitory activity. Bioorg Med Chem25:677-683 (2017) 
 
Carbonic anhydrase 12
Name:Carbonic anhydrase 12
Type:Enzyme
Mol. Mass.:39456.00
Organism:Homo sapiens (Human)
Description:Catalytic domain of human cloned isozyme was used in the assay
Residue:354
BDBM50207539
NameBDBM50207539
Synonyms:CHEMBL3976024
TypeSmall organic molecule
Emp. Form.C7H6N2O3S
Mol. Mass.198.199
SMILESO=C1Nc2ccccc2S(=O)(=O)N1