Reaction Details
TargetCarbonic anhydrase 1
LigandBDBM50207540
Substrate/Competitorn/a
Meas. Tech.ChEMBL_1632052 (CHEMBL3874758)
Ki>500000±n/a nM
Citation Bozdag, MAlafeefy, AMAltamimi, AMVullo, DCarta, FSupuran, CT Coumarins and other fused bicyclic heterocycles with selective tumor-associated carbonic anhydrase isoforms inhibitory activity. Bioorg Med Chem25:677-683 (2017) 
 
Carbonic anhydrase 1
Name:Carbonic anhydrase 1
Type:Enzyme
Mol. Mass.:28873.37
Organism:Homo sapiens (Human)
Description:P00915
Residue:261
BDBM50207540
NameBDBM50207540
Synonyms:CHEMBL3896854
TypeSmall organic molecule
Emp. Form.C24H14F4N2O4
Mol. Mass.470.3726
SMILESFc1ccc(cc1)C(=O)Nc1ccccc1C(=O)Nc1ccc2c(cc(=O)oc2c1)C(F)(F)F