Reaction Details
TargetCarbonic anhydrase 2
LigandBDBM50207540
Substrate/Competitorn/a
Meas. Tech.ChEMBL_1632053 (CHEMBL3874759)
Ki>500000±n/a nM
Citation Bozdag, MAlafeefy, AMAltamimi, AMVullo, DCarta, FSupuran, CT Coumarins and other fused bicyclic heterocycles with selective tumor-associated carbonic anhydrase isoforms inhibitory activity. Bioorg Med Chem25:677-683 (2017) 
 
Carbonic anhydrase 2
Name:Carbonic anhydrase 2
Type:Enzyme
Mol. Mass.:29250.71
Organism:Homo sapiens (Human)
Description:P00918
Residue:260
BDBM50207540
NameBDBM50207540
Synonyms:CHEMBL3896854
TypeSmall organic molecule
Emp. Form.C24H14F4N2O4
Mol. Mass.470.3726
SMILESFc1ccc(cc1)C(=O)Nc1ccccc1C(=O)Nc1ccc2c(cc(=O)oc2c1)C(F)(F)F