Reaction Details
TargetCarbonic anhydrase 12
LigandBDBM27504
Substrate/Competitorn/a
Meas. Tech.ChEMBL_1632055 (CHEMBL3874761)
Ki 10460±n/a nM
Citation Bozdag, MAlafeefy, AMAltamimi, AMVullo, DCarta, FSupuran, CT Coumarins and other fused bicyclic heterocycles with selective tumor-associated carbonic anhydrase isoforms inhibitory activity. Bioorg Med Chem25:677-683 (2017) 
 
Carbonic anhydrase 12
Name:Carbonic anhydrase 12
Type:Enzyme
Mol. Mass.:39456.00
Organism:Homo sapiens (Human)
Description:Catalytic domain of human cloned isozyme was used in the assay
Residue:354
BDBM27504
NameBDBM27504
Synonyms:4-HQN CHEMBL266540 | quinazolin-4-ol
TypeSmall organic molecule
Emp. Form.C8H6N2O
Mol. Mass.146.146
SMILESO=c1[nH]cnc2ccccc12