Reaction Details
TargetCarbonic anhydrase 12
LigandBDBM50106196
Substrate/Competitorn/a
Meas. Tech.ChEMBL_1632055 (CHEMBL3874761)
Ki 8650±n/a nM
Citation Bozdag, MAlafeefy, AMAltamimi, AMVullo, DCarta, FSupuran, CT Coumarins and other fused bicyclic heterocycles with selective tumor-associated carbonic anhydrase isoforms inhibitory activity. Bioorg Med Chem25:677-683 (2017) 
 
Carbonic anhydrase 12
Name:Carbonic anhydrase 12
Type:Enzyme
Mol. Mass.:39456.00
Organism:Homo sapiens (Human)
Description:Catalytic domain of human cloned isozyme was used in the assay
Residue:354
BDBM50106196
NameBDBM50106196
Synonyms:(1H )-Quinazolin-2,4-dione CHEMBL421646 | Quinazoline-2,4-diol
TypeSmall organic molecule
Emp. Form.C8H6N2O2
Mol. Mass.162.1454
SMILESO=c1[nH]c2ccccc2c(=O)[nH]1