Reaction Details
TargetCarbonic anhydrase 1
LigandBDBM50207549
Substrate/Competitorn/a
Meas. Tech.ChEMBL_1632052 (CHEMBL3874758)
Ki>500000±n/a nM
Citation Bozdag, MAlafeefy, AMAltamimi, AMVullo, DCarta, FSupuran, CT Coumarins and other fused bicyclic heterocycles with selective tumor-associated carbonic anhydrase isoforms inhibitory activity. Bioorg Med Chem25:677-683 (2017) 
 
Carbonic anhydrase 1
Name:Carbonic anhydrase 1
Type:Enzyme
Mol. Mass.:28873.37
Organism:Homo sapiens (Human)
Description:P00915
Residue:261
BDBM50207549
NameBDBM50207549
Synonyms:CHEMBL3928695
TypeSmall organic molecule
Emp. Form.C24H18N2O4
Mol. Mass.398.4107
SMILESCc1cc(=O)oc2cc(NC(=O)c3ccccc3NC(=O)c3ccccc3)ccc12