Reaction Details
TargetCarbonic anhydrase 1
LigandBDBM50207982
Substrate/Competitorn/a
Meas. Tech.ChEMBL_1632267 (CHEMBL3874973)
Ki 295±n/a nM
Citation Vullo, DDel Prete, SNocentini, AOsman, SMAlOthman, ZCapasso, CBozdag, MCarta, FGratteri, PSupuran, CT Dithiocarbamates effectively inhibit the฿-carbonic anhydrase from the dandruff-producing fungus Malassezia globosa. Bioorg Med Chem25:1260-1265 (2017) 
 
Carbonic anhydrase 1
Name:Carbonic anhydrase 1
Type:Enzyme
Mol. Mass.:28873.37
Organism:Homo sapiens (Human)
Description:P00915
Residue:261
BDBM50207982
NameBDBM50207982
Synonyms:CHEMBL3903785
TypeSmall organic molecule
Emp. Form.C5H10NNaOS2
Mol. Mass.187.259
SMILES[Na+].OCCCCNC([S-])=S