Reaction Details
TargetCarbonic anhydrase 1
LigandBDBM50067998
Substrate/Competitorn/a
Meas. Tech.ChEMBL_1632267 (CHEMBL3874973)
Ki 240±n/a nM
Citation Vullo, DDel Prete, SNocentini, AOsman, SMAlOthman, ZCapasso, CBozdag, MCarta, FGratteri, PSupuran, CT Dithiocarbamates effectively inhibit the฿-carbonic anhydrase from the dandruff-producing fungus Malassezia globosa. Bioorg Med Chem25:1260-1265 (2017) 
 
Carbonic anhydrase 1
Name:Carbonic anhydrase 1
Type:Enzyme
Mol. Mass.:28873.37
Organism:Homo sapiens (Human)
Description:P00915
Residue:261
BDBM50067998
NameBDBM50067998
Synonyms:CHEMBL3400802
TypeSmall organic molecule
Emp. Form.C8H13N2NaS2
Mol. Mass.224.322
SMILES[Na+].[S-]C(=S)N[C@H]1CN2CCC1CC2