Reaction Details
TargetCarbonic anhydrase 2
LigandBDBM50067997
Substrate/Competitorn/a
Meas. Tech.ChEMBL_1632268 (CHEMBL3874974)
Ki 49±n/a nM
Citation Vullo, DDel Prete, SNocentini, AOsman, SMAlOthman, ZCapasso, CBozdag, MCarta, FGratteri, PSupuran, CT Dithiocarbamates effectively inhibit the฿-carbonic anhydrase from the dandruff-producing fungus Malassezia globosa. Bioorg Med Chem25:1260-1265 (2017) 
 
Carbonic anhydrase 2
Name:Carbonic anhydrase 2
Type:Enzyme
Mol. Mass.:29250.71
Organism:Homo sapiens (Human)
Description:P00918
Residue:260
BDBM50067997
NameBDBM50067997
Synonyms:CHEMBL3400801
TypeSmall organic molecule
Emp. Form.C8H13N2NaS2
Mol. Mass.224.322
SMILES[Na+].[S-]C(=S)NC1CN2CCC1CC2