Reaction Details
TargetCarbonic anhydrase 1
LigandBDBM50067988
Substrate/Competitorn/a
Meas. Tech.ChEMBL_1632267 (CHEMBL3874973)
Ki 434±n/a nM
Citation Vullo, DDel Prete, SNocentini, AOsman, SMAlOthman, ZCapasso, CBozdag, MCarta, FGratteri, PSupuran, CT Dithiocarbamates effectively inhibit the฿-carbonic anhydrase from the dandruff-producing fungus Malassezia globosa. Bioorg Med Chem25:1260-1265 (2017) 
 
Carbonic anhydrase 1
Name:Carbonic anhydrase 1
Type:Enzyme
Mol. Mass.:28873.37
Organism:Homo sapiens (Human)
Description:P00915
Residue:261
BDBM50067988
NameBDBM50067988
Synonyms:CHEMBL3400812
TypeSmall organic molecule
Emp. Form.C6H10NNaOS2
Mol. Mass.199.269
SMILES[Na+].CC1COCCN1C([S-])=S