Reaction Details
TargetcAMP-specific 3',5'-cyclic phosphodiesterase 4C
LigandBDBM50208311
Substrate/Competitorn/a
Meas. Tech.ChEMBL_1632646 (CHEMBL3875438)
IC50 294±n/a nM
Citation Zhou, ZZGe, BCZhong, QPHuang, CCheng, YFYang, XMWang, HTXu, JP Development of highly potent phosphodiesterase 4 inhibitors with anti-neuroinflammation potential: Design, synthesis, and structure-activity relationship study of catecholamides bearing aromatic rings. Eur J Med Chem124:372-379 (2016) 
 
cAMP-specific 3',5'-cyclic phosphodiesterase 4C
Name:cAMP-specific 3',5'-cyclic phosphodiesterase 4C
Type:Enzyme Catalytic Domain
Mol. Mass.:79875.54
Organism:Homo sapiens (Human)
Description:Q08493
Residue:712
BDBM50208311
NameBDBM50208311
Synonyms:CHEMBL3885161
TypeSmall organic molecule
Emp. Form.C18H18F2N2O3
Mol. Mass.348.3439
SMILESFC(F)Oc1ccc(cc1OC1CCCC1)C(=O)Nc1cccnc1