Reaction Details
TargetcAMP-specific 3',5'-cyclic phosphodiesterase 4B
LigandBDBM50208315
Substrate/Competitorn/a
Meas. Tech.ChEMBL_1632645 (CHEMBL3875437)
IC50 34±n/a nM
Citation Zhou, ZZGe, BCZhong, QPHuang, CCheng, YFYang, XMWang, HTXu, JP Development of highly potent phosphodiesterase 4 inhibitors with anti-neuroinflammation potential: Design, synthesis, and structure-activity relationship study of catecholamides bearing aromatic rings. Eur J Med Chem124:372-379 (2016) 
 
cAMP-specific 3',5'-cyclic phosphodiesterase 4B
Name:cAMP-specific 3',5'-cyclic phosphodiesterase 4B
Type:Protein
Mol. Mass.:83318.87
Organism:Homo sapiens (Human)
Description:Q07343
Residue:736
BDBM50208315
NameBDBM50208315
Synonyms:CHEMBL3884224
TypeSmall organic molecule
Emp. Form.C17H16F2N2O3
Mol. Mass.334.3173
SMILESFC(F)Oc1ccc(cc1OCC1CC1)C(=O)Nc1cccnc1