Reaction Details
TargetcGMP-inhibited 3',5'-cyclic phosphodiesterase 3B
LigandBDBM50208314
Substrate/Competitorn/a
Meas. Tech.ChEMBL_1632642 (CHEMBL3875434)
IC50>100000±n/a nM
Citation Zhou, ZZGe, BCZhong, QPHuang, CCheng, YFYang, XMWang, HTXu, JP Development of highly potent phosphodiesterase 4 inhibitors with anti-neuroinflammation potential: Design, synthesis, and structure-activity relationship study of catecholamides bearing aromatic rings. Eur J Med Chem124:372-379 (2016) 
 
cGMP-inhibited 3',5'-cyclic phosphodiesterase 3B
Name:cGMP-inhibited 3',5'-cyclic phosphodiesterase 3B
Type:Enzyme
Mol. Mass.:124318.95
Organism:Homo sapiens (Human)
Description:PDE3B was generated from the full-length recombinant human clone transfected into Sf9 cells.
Residue:1112
BDBM50208314
NameBDBM50208314
Synonyms:CHEMBL3884788
TypeSmall organic molecule
Emp. Form.C18H16ClF2NO3
Mol. Mass.367.774
SMILESFC(F)Oc1ccc(cc1OCC1CC1)C(=O)Nc1ccccc1Cl