Reaction Details
TargetDual specificity tyrosine-phosphorylation-regulated kinase 1B
LigandBDBM50208715
Substrate/Competitorn/a
Meas. Tech.ChEMBL_1633066 (CHEMBL3875858)
IC50 100±n/a nM
Citation Labrière, CLozach, OBlairvacq, MMeijer, LGuillou, C Further investigation of Paprotrain: Towards the conception of selective and multi-targeted CNS kinase inhibitors. Eur J Med Chem124:920-934 (2016) 
 
Dual specificity tyrosine-phosphorylation-regulated kinase 1B
Name:Dual specificity tyrosine-phosphorylation-regulated kinase 1B
Type:Enzyme
Mol. Mass.:69222.24
Organism:Homo sapiens (Human)
Description:Q9Y463
Residue:629
BDBM50208715
NameBDBM50208715
Synonyms:CHEMBL3884570
TypeSmall organic molecule
Emp. Form.C16H12N4O
Mol. Mass.276.2927
SMILESCOc1ccc2c(c[nH]c2n1)C(=C\c1cccnc1)\C#N