Reaction Details
TargetDual specificity protein kinase CLK3
LigandBDBM50208709
Substrate/Competitorn/a
Meas. Tech.ChEMBL_1633068 (CHEMBL3875860)
IC50 710±n/a nM
Citation Labrière, CLozach, OBlairvacq, MMeijer, LGuillou, C Further investigation of Paprotrain: Towards the conception of selective and multi-targeted CNS kinase inhibitors. Eur J Med Chem124:920-934 (2016) 
 
Dual specificity protein kinase CLK3
Name:Dual specificity protein kinase CLK3
Type:Protein
Mol. Mass.:73570.11
Organism:Homo sapiens (Human)
Description:n/a
Residue:638
BDBM50208709
NameBDBM50208709
Synonyms:CHEMBL3883639
TypeSmall organic molecule
Emp. Form.C17H11N3O
Mol. Mass.273.2887
SMILESCOc1ccc2[nH]c3c(c(cc4cnccc34)C#N)c2c1