Reaction Details
TargetDual specificity tyrosine-phosphorylation-regulated kinase 1A
LigandBDBM50208626
Substrate/Competitorn/a
Meas. Tech.ChEMBL_1633064 (CHEMBL3875856)
IC50 18±n/a nM
Citation Labrière, CLozach, OBlairvacq, MMeijer, LGuillou, C Further investigation of Paprotrain: Towards the conception of selective and multi-targeted CNS kinase inhibitors. Eur J Med Chem124:920-934 (2016) 
 
Dual specificity tyrosine-phosphorylation-regulated kinase 1A
Name:Dual specificity tyrosine-phosphorylation-regulated kinase 1A
Type:Enzyme
Mol. Mass.:85616.61
Organism:Homo sapiens (Human)
Description:Q13627
Residue:763
BDBM50208626
NameBDBM50208626
Synonyms:CHEMBL3884821
TypeSmall organic molecule
Emp. Form.C18H13N3O2
Mol. Mass.303.3147
SMILESCOc1ccc2c(c1)[nH]c1c2c(cc2cncc(OC)c12)C#N