Reaction Details
TargetD(1B) dopamine receptor
LigandBDBM86180
Substrate/Competitorn/a
Meas. Tech.ChEMBL_1633565 (CHEMBL3876357)
IC50 0.560±n/a nM
Citation Gunia-Krzyzak, AZelaszczyk, DRapacz, AZeslawska, EWaszkielewicz, AMPanczyk, KSloczynska, KPekala, ENitek, WFilipek, BMarona, H Structure-anticonvulsant activity studies in the group of (E)-N-cinnamoyl aminoalkanols derivatives monosubstituted in phenyl ring with 4-Cl, 4-CH Bioorg Med Chem25:471-482 (2017) 
 
D(1B) dopamine receptor
Name:D(1B) dopamine receptor
Type:Protein
Mol. Mass.:52943.41
Organism:Homo sapiens (Human)
Description:P21918
Residue:477
BDBM86180
NameBDBM86180
Synonyms:CAS_87075-17-0 SCH 23390 US9359372, SCH23390
TypeSmall organic molecule
Emp. Form.C17H18ClNO
Mol. Mass.287.784
SMILESCN1CCc2cc(Cl)c(O)cc2C(C1)c1ccccc1