Reaction Details
TargetSodium-dependent dopamine transporter
LigandBDBM50005534
Substrate/Competitorn/a
Meas. Tech.ChEMBL_1633617 (CHEMBL3876409)
IC50 2.8±n/a nM
Citation Gunia-Krzyzak, AZelaszczyk, DRapacz, AZeslawska, EWaszkielewicz, AMPanczyk, KSloczynska, KPekala, ENitek, WFilipek, BMarona, H Structure-anticonvulsant activity studies in the group of (E)-N-cinnamoyl aminoalkanols derivatives monosubstituted in phenyl ring with 4-Cl, 4-CH Bioorg Med Chem25:471-482 (2017) 
 
Sodium-dependent dopamine transporter
Name:Sodium-dependent dopamine transporter
Type:Multi-pass membrane protein
Mol. Mass.:68497.11
Organism:Homo sapiens (Human)
Description:Q01959
Residue:620
BDBM50005534
NameBDBM50005534
Synonyms:1-(1-(benzo[b]thiophen-2-yl)cyclohexyl)piperidine 1-(1-Benzo[b]thiophen-2-yl-cyclohexyl)-piperidine(BTCP) 3-[(3-Chloro-phenyl)-phenyl-methoxy]-8-methyl-8-aza-bicyclo[3.2.1]octane | CHEMBL279556
TypeSmall organic molecule
Emp. Form.C19H25NS
Mol. Mass.299.474
SMILESC1CCN(CC1)C1(CCCCC1)c1cc2ccccc2s1