Reaction Details
TargetAdenosine receptor A2a
LigandBDBM21220
Substrate/Competitorn/a
Meas. Tech.ChEMBL_1633545 (CHEMBL3876337)
IC50 37.0±n/a nM
Citation Gunia-Krzyzak, AZelaszczyk, DRapacz, AZeslawska, EWaszkielewicz, AMPanczyk, KSloczynska, KPekala, ENitek, WFilipek, BMarona, H Structure-anticonvulsant activity studies in the group of (E)-N-cinnamoyl aminoalkanols derivatives monosubstituted in phenyl ring with 4-Cl, 4-CH Bioorg Med Chem25:471-482 (2017) 
 
Adenosine receptor A2a
Name:Adenosine receptor A2a
Type:G Protein-Coupled Receptor (GPCR)
Mol. Mass.:44716.46
Organism:Homo sapiens (Human)
Description:P29274
Residue:412
BDBM21220
NameBDBM21220
Synonyms:(2S,3S,4R,5R)-5-(6-amino-9H-purin-9-yl)-N-ethyl-3,4-dihydroxyoxolane-2-carboxamide Adenosine, N6-Ethyl-carboxamido CHEMBL464859 NECA
TypeAntineoplastic Agent
Emp. Form.C12H16N6O4
Mol. Mass.308.2932
SMILESCCNC(=O)[C@H]1O[C@H]([C@H](O)[C@@H]1O)n1cnc2c(N)ncnc12