Reaction Details
TargetD(1A) dopamine receptor
LigandBDBM86180
Substrate/Competitorn/a
Meas. Tech.ChEMBL_1633561 (CHEMBL3876353)
IC50 0.310±n/a nM
Citation Gunia-Krzyzak, AZelaszczyk, DRapacz, AZeslawska, EWaszkielewicz, AMPanczyk, KSloczynska, KPekala, ENitek, WFilipek, BMarona, H Structure-anticonvulsant activity studies in the group of (E)-N-cinnamoyl aminoalkanols derivatives monosubstituted in phenyl ring with 4-Cl, 4-CH Bioorg Med Chem25:471-482 (2017) 
 
D(1A) dopamine receptor
Name:D(1A) dopamine receptor
Type:Enzyme
Mol. Mass.:49303.43
Organism:Homo sapiens (Human)
Description:P21728
Residue:446
BDBM86180
NameBDBM86180
Synonyms:CAS_87075-17-0 SCH 23390 US9359372, SCH23390
TypeSmall organic molecule
Emp. Form.C17H18ClNO
Mol. Mass.287.784
SMILESCN1CCc2cc(Cl)c(O)cc2C(C1)c1ccccc1