Reaction Details
TargetPeroxisome proliferator-activated receptor gamma
LigandBDBM50030474
Substrate/Competitorn/a
Meas. Tech.ChEMBL_1633591 (CHEMBL3876383)
IC50 10.00±n/a nM
Citation Gunia-Krzyzak, AZelaszczyk, DRapacz, AZeslawska, EWaszkielewicz, AMPanczyk, KSloczynska, KPekala, ENitek, WFilipek, BMarona, H Structure-anticonvulsant activity studies in the group of (E)-N-cinnamoyl aminoalkanols derivatives monosubstituted in phenyl ring with 4-Cl, 4-CH Bioorg Med Chem25:471-482 (2017) 
 
Peroxisome proliferator-activated receptor gamma
Name:Peroxisome proliferator-activated receptor gamma
Type:Nuclear Receptor
Mol. Mass.:57613.46
Organism:Homo sapiens (Human)
Description:P37231
Residue:505
BDBM50030474
NameBDBM50030474
Synonyms:Avandamet Avandia CHEBI:50122 US10744117, Compound Rosiglitazone | US9562012, rosiglitazone
TypeSmall organic molecule
Emp. Form.C18H19N3O3S
Mol. Mass.357.427
SMILESCN(CCOc1ccc(CC2SC(=O)NC2=O)cc1)c1ccccn1