Reaction Details
TargetSphingosine 1-phosphate receptor 1
LigandBDBM50209028
Substrate/Competitorn/a
Meas. Tech.ChEBML_1633659
EC50>100000±n/a nM
Citation Hur, WRosen, HGray, NS A benzo[b]thiophene-based selective type 4 S1P receptor agonist. Bioorg Med Chem Lett27:1-5 (2017) 
 
Sphingosine 1-phosphate receptor 1
Name:Sphingosine 1-phosphate receptor 1
Type:Enzyme
Mol. Mass.:42836.02
Organism:Homo sapiens (Human)
Description:P21453
Residue:382
BDBM50209028
NameBDBM50209028
Synonyms:CHEMBL3883812
TypeSmall organic molecule
Emp. Form.C22H19NO2S
Mol. Mass.361.457
SMILESOC(=O)CCNCc1cc2c(cccc2s1)-c1ccc2ccccc2c1