Reaction Details
TargetSphingosine 1-phosphate receptor 5
LigandBDBM50209054
Substrate/Competitorn/a
Meas. Tech.ChEMBL_1633656 (CHEMBL3876448)
EC50>100000±n/a nM
Citation Hur, WRosen, HGray, NS A benzo[b]thiophene-based selective type 4 S1P receptor agonist. Bioorg Med Chem Lett27:1-5 (2017) 
 
Sphingosine 1-phosphate receptor 5
Name:Sphingosine 1-phosphate receptor 5
Type:G Protein-Coupled Receptor (GPCR)
Mol. Mass.:41796.42
Organism:Homo sapiens (Human)
Description:n/a
Residue:398
BDBM50209054
NameBDBM50209054
Synonyms:CHEMBL3885357
TypeSmall organic molecule
Emp. Form.C24H23NO3S
Mol. Mass.405.509
SMILESCOc1ccc2cc(ccc2c1)-c1cccc2cc(CNCCCC(O)=O)sc12