Reaction Details
TargetSphingosine 1-phosphate receptor 1
LigandBDBM50209074
Substrate/Competitorn/a
Meas. Tech.ChEMBL_1633659 (CHEMBL3876451)
EC50>100000±n/a nM
Citation Hur, WRosen, HGray, NS A benzo[b]thiophene-based selective type 4 S1P receptor agonist. Bioorg Med Chem Lett27:1-5 (2017) 
 
Sphingosine 1-phosphate receptor 1
Name:Sphingosine 1-phosphate receptor 1
Type:Enzyme
Mol. Mass.:42836.02
Organism:Homo sapiens (Human)
Description:P21453
Residue:382
BDBM50209074
NameBDBM50209074
Synonyms:CHEMBL3885331
TypeSmall organic molecule
Emp. Form.C23H21NO2S
Mol. Mass.375.483
SMILESOC(=O)CCCNCc1cc2c(cccc2s1)-c1ccc2ccccc2c1